{"text_format":"1","workbook":"xlsx","n_sheets":11,"sheets":["JMF SUBMITTAL FORM","JMF INPUT SHEET","STATUS LETTER","LOOKUP TABLES","AGG MATL CD LIST","RM_NAME_CODE","AGG PROD LIST","AGG MATL LIST","Cm MATL LIST","ADMIX PS LIST","ADMIX PRODUCT LIST"],"not_rendered":{"charts":0,"images":1,"macros":1,"external_links":0,"defined_names":29,"comments":0,"pivot_tables":0},"unopened":[],"bounds":{"document_bytes":16777216,"sheet_cells":100000,"rows_first":2000,"rows_last":500,"rows_between":2000,"halvings":0,"cell_chars":16384,"cell_head_chars":4096},"cells_cut":0,"cells_raw":0,"read":"whole","date_system":"1900"}

{"sheet":"JMF SUBMITTAL FORM","index":0,"n_rows":150,"n_cols":36,"rows_kept":150,"cut":false,"hidden":false,"merged":[[94,0,121,1],[93,0,93,36],[112,14,112,16],[112,19,112,21],[112,9,112,11],[110,25,110,26],[85,18,85,19],[98,19,98,21],[108,9,108,11],[97,27,120,28],[114,14,114,16],[110,14,110,16],[120,2,120,7],[120,9,120,11],[100,2,100,7],[112,2,112,7],[106,9,106,11],[104,9,104,11],[100,25,100,26],[102,25,102,26],[118,9,118,11],[102,2,102,7],[104,2,104,7],[106,2,106,7],[140,28,140,29],[138,31,138,34],[81,0,81,36],[91,3,91,5],[89,3,89,5],[87,3,87,5],[85,3,85,5],[91,6,91,8],[89,6,89,8],[87,6,87,8],[85,6,85,8],[87,29,87,32],[85,29,85,32],[89,18,89,19],[91,18,91,19],[85,21,85,23],[87,21,87,23],[132,22,132,27],[82,0,92,1],[102,29,102,31],[100,29,100,31],[98,29,98,31],[98,9,98,11],[98,14,98,16],[39,3,39,16],[108,14,108,16],[98,24,98,26],[108,19,108,21],[95,23,96,27],[87,18,87,19],[47,26,47,31],[65,26,65,30],[68,27,68,31],[106,25,106,26],[108,25,108,26],[104,25,104,26],[63,6,63,7],[63,9,63,13],[63,14,63,15],[63,17,63,21],[55,3,55,11],[53,3,53,11],[53,13,53,24],[55,30,55,31],[53,30,53,31],[89,25,89,27],[87,25,87,27],[85,25,85,27],[41,3,41,16],[45,18,45,24],[43,18,43,24],[70,32,70,34],[95,8,96,12],[95,13,96,17],[95,18,96,22],[82,3,82,14],[82,21,82,32],[70,13,70,25],[72,3,72,11],[70,3,70,11],[72,32,72,34],[76,32,76,34],[74,32,74,34],[76,27,76,31],[51,3,51,11],[51,13,51,24],[45,32,45,34],[43,32,43,34],[41,32,41,34],[91,29,91,32],[57,32,57,34],[55,32,55,34],[53,32,53,34],[59,13,59,24],[57,13,57,24],[55,13,55,24],[62,22,64,24],[63,32,63,34],[63,26,63,31],[55,26,55,27],[53,26,53,27],[61,32,61,34],[61,28,61,31],[61,1,61,17],[72,0,72,2],[76,0,76,2],[70,27,70,31],[72,27,72,31],[74,27,74,31],[74,0,74,2],[74,13,74,25],[72,13,72,25],[83,25,83,27],[83,15,83,19],[83,5,83,9],[70,0,70,2],[83,10,83,12],[124,5,124,7],[116,9,116,11],[110,9,110,11],[120,19,120,21],[118,19,118,21],[116,19,116,21],[114,19,114,21],[110,19,110,21],[120,14,120,16],[108,2,108,7],[110,2,110,7],[74,3,74,11],[76,13,76,25],[82,16,82,20],[102,19,102,21],[100,19,100,21],[106,14,106,16],[104,14,104,16],[106,19,106,21],[104,19,104,21],[100,24,120,24],[98,2,98,7],[114,2,114,7],[116,2,116,7],[76,3,76,11],[118,2,118,7],[91,10,91,12],[89,10,89,12],[102,14,102,16],[100,14,100,16],[89,21,89,23],[91,21,91,23],[91,25,91,27],[102,9,102,11],[126,17,126,19],[110,29,110,31],[108,29,108,31],[106,29,106,31],[104,29,104,31],[126,22,126,27],[124,22,124,27],[112,25,112,26],[118,14,118,16],[116,14,116,16],[138,28,138,29],[136,30,136,35],[134,22,134,25],[136,22,136,25],[128,28,128,30],[126,28,126,30],[128,17,128,19],[114,9,114,11],[126,11,126,13],[134,11,134,13],[124,28,124,30],[114,25,114,26],[116,25,116,26],[118,25,118,26],[120,25,120,26],[124,17,124,19],[124,11,124,13],[136,26,136,28],[134,26,134,28],[132,28,132,29],[130,22,130,27],[130,28,130,29],[128,22,128,27],[128,11,128,13],[126,5,126,7],[128,5,128,7],[126,32,126,35],[128,32,128,35],[130,32,130,35],[132,32,132,35],[59,30,59,31],[57,30,57,31],[57,0,57,2],[65,1,65,13],[59,32,59,34],[68,0,68,2],[122,0,122,36],[66,13,66,25],[68,13,68,25],[68,3,68,11],[63,2,63,5],[57,26,57,27],[59,0,59,2],[59,3,59,11],[57,3,57,11],[59,26,59,27],[89,29,89,32],[100,9,100,11],[140,5,140,7],[130,17,130,19],[130,5,130,7],[130,11,130,13],[132,5,132,7],[132,11,132,13],[134,5,134,7],[138,11,138,13],[138,17,138,19],[140,11,140,13],[140,17,140,19],[132,17,132,19],[134,17,134,19],[136,11,136,13],[136,17,136,19],[136,5,136,7],[138,5,138,7],[11,7,11,20],[15,7,15,20],[13,7,13,20],[23,0,23,36],[17,0,17,36],[24,0,24,8],[24,9,24,16],[18,0,18,36],[20,24,20,25],[20,18,20,20],[22,18,22,20],[22,21,22,23],[22,1,22,6],[20,1,20,6],[13,22,13,29],[15,22,15,29],[15,30,15,35],[13,30,13,35],[11,22,11,25],[11,26,11,35],[11,1,11,6],[20,32,20,33],[20,34,20,35],[24,18,24,21],[13,1,13,6],[15,1,15,6],[39,32,39,34],[39,18,39,24],[43,29,43,30],[41,29,41,30],[45,26,45,27],[43,26,43,27],[41,26,41,27],[24,22,24,24],[24,25,24,27],[29,30,29,34],[30,29,31,35],[33,0,33,36],[38,0,38,36],[39,0,39,2],[45,35,45,36],[41,0,41,2],[45,0,45,2],[45,3,45,16],[43,3,43,16],[20,7,20,10],[26,7,26,10],[26,12,26,15],[0,0,0,36],[9,0,9,36],[2,7,2,23],[4,7,4,23],[6,7,6,23],[6,30,6,35],[4,30,4,35],[2,30,2,35],[2,25,2,29],[4,25,4,29],[6,25,6,29],[2,1,2,6],[3,1,3,6],[4,1,4,6],[6,1,6,6],[8,0,8,36],[49,1,49,15],[51,26,51,27],[145,0,156,1],[145,2,156,19],[145,20,156,21],[147,31,149,35],[153,31,155,35],[138,21,138,27],[140,21,140,27],[142,11,142,13],[142,17,142,19],[142,5,142,7],[144,0,144,36],[147,23,147,29],[145,23,145,29],[149,23,149,29],[151,23,151,29],[123,0,143,1],[53,0,53,2],[55,0,55,2],[65,31,65,35],[68,32,68,34],[66,27,66,31],[66,3,66,11],[48,0,48,36],[43,0,43,2],[37,3,37,16],[37,18,37,24],[35,0,35,36],[36,1,36,14],[37,31,37,35],[34,0,34,15],[22,7,22,10],[37,26,37,27],[37,29,37,30],[37,0,37,2],[47,35,47,36],[45,29,45,30],[47,1,47,13],[39,29,39,30],[39,26,39,27],[47,14,47,16],[47,32,47,34],[41,18,41,24],[36,26,36,30],[43,35,43,36],[41,35,41,36],[39,35,39,36],[20,12,20,17],[22,12,22,17],[26,16,26,18],[26,20,26,23],[22,24,22,26],[26,24,26,35],[26,1,26,6],[36,33,36,34],[34,26,34,33],[34,34,34,36],[20,29,20,31],[20,21,20,23],[28,0,28,36],[20,27,20,28]]}
["CONCRETE PRODUCER INFORMATION"]
[]
[null,"Company Name",null,null,null,null,null,null,null,null,null,null,null,null,null,null,null,null,null,null,null,null,null,null,null,"P/S Number",null,null,null,null,{"$f":"IF(ISBLANK(H3),\" \",VLOOKUP(H3,RM_NAME_CODE!A:B,2,0))","v":" "}]
[]
[null,"Rep Name",null,null,null,null,null,null,null,null,null,null,null,null,null,null,null,null,null,null,null,null,null,null,null,"Plant Phone"]
[]
[null,"email address",null,null,null,null,null,null,null,null,null,null,null,null,null,null,null,null,null,null,null,null,null,null,null,"Cell Phone"]
[]
[]
["TESTING LABORATORY INFORMATION"]
[]
[null,"Lab Name",null,null,null,null,null,null,null,null,null,null,null,null,null,null,null,null,null,null,null,null,"Location"]
[]
[null,"Lab Rep",null,null,null,null,null,null,null,null,null,null,null,null,null,null,null,null,null,null,null,null,"Phone"]
[]
{"$rows_left_out":136}
{"sheet":"JMF INPUT SHEET","index":1,"n_rows":40,"n_cols":12,"rows_kept":40,"cut":false,"hidden":false,"merged":[[19,11,19,13],[22,11,22,13],[21,11,21,13],[20,11,20,13],[23,10,23,12],[7,8,8,9],[7,10,8,10],[9,8,10,9],[9,10,10,10],[11,8,12,9],[11,10,12,10],[1,10,2,10],[3,8,4,9],[3,10,4,10],[5,8,6,9],[5,10,6,10],[34,0,39,7],[21,2,21,3],[21,0,21,1],[20,0,20,1],[19,0,19,1],[31,0,31,1],[30,0,30,1],[29,0,29,1],[28,0,28,1],[27,0,27,1],[26,0,26,1],[23,0,23,1],[22,0,22,1],[29,8,29,9],[30,8,30,9],[31,8,31,9],[18,1,18,2],[17,0,17,4],[13,6,13,7],[14,6,14,7],[15,6,15,7],[17,5,17,13],[33,0,33,7],[33,8,33,13],[32,0,32,1],[25,0,25,4],[22,2,22,4],[23,2,23,3],[24,0,24,1],[26,10,26,12],[25,10,25,12],[24,10,24,12],[27,8,27,9],[28,8,28,9],[0,5,0,6],[0,8,0,10],[1,11,12,13],[0,11,0,13],[12,6,12,7],[1,5,1,6],[2,5,2,6],[3,5,3,6],[4,5,4,6],[11,6,11,7],[5,5,5,6],[8,5,8,6],[7,5,7,6],[6,5,6,6],[10,6,10,7],[1,8,2,9]]}
[null,"SSD WT","SP GR","ABS VOL","% BY MASS","MATERIAL",null,"MATL CODE","CONRETE PROPERTIES",null,null,"SUBMITTER REMARKS"]
["AGG 1",{"$f":"'JMF SUBMITTAL FORM'!AG40","v":0},{"$f":"'JMF SUBMITTAL FORM'!AA40","v":0},{"$f":"IF(B2=0,0,B2/(62.4*C2))","v":0},{"$f":"B2/SUM(B$2,B$3,B$4,B$5)","v":{"$error":"#DIV/0!"}},{"$f":"IF(ISBLANK('JMF SUBMITTAL FORM'!S40),\" \",'JMF SUBMITTAL FORM'!S40)","v":" "},null,null,"TOTAL AGG WT",null,{"$f":"SUM(B2:B5)","v":0},{"$f":"'JMF SUBMITTAL FORM'!C146","v":0}]
["AGG 2",{"$f":"'JMF SUBMITTAL FORM'!AG42","v":0},{"$f":"'JMF SUBMITTAL FORM'!AA42","v":0},0,{"$f":"B3/SUM(B$2,B$3,B$4,B$5)","v":{"$error":"#DIV/0!"}},{"$f":"IF(ISBLANK('JMF SUBMITTAL FORM'!S42),\" \",'JMF SUBMITTAL FORM'!S42)","v":" "}]
["AGG 3",{"$f":"'JMF SUBMITTAL FORM'!AG44","v":0},{"$f":"'JMF SUBMITTAL FORM'!AA44","v":0},0,{"$f":"B4/SUM(B$2,B$3,B$4,B$5)","v":{"$error":"#DIV/0!"}},{"$f":"IF(ISBLANK('JMF SUBMITTAL FORM'!S44),\" \",'JMF SUBMITTAL FORM'!S44)","v":" "},null,null,"TOTAL Cm WT",null,{"$f":"SUM(B6:B9)","v":0}]
["AGG 4",{"$f":"'JMF SUBMITTAL FORM'!AG46","v":0},{"$f":"'JMF SUBMITTAL FORM'!AA46","v":0},0,{"$f":"B5/SUM(B$2,B$3,B$4,B$5)","v":{"$error":"#DIV/0!"}},{"$f":"IF(ISBLANK('JMF SUBMITTAL FORM'!S46),\" \",'JMF SUBMITTAL FORM'!S46)","v":" "}]
["Cm 1",{"$f":"'JMF SUBMITTAL FORM'!AG54","v":0},{"$f":"'JMF SUBMITTAL FORM'!AA54","v":0},0,{"$f":"B6/SUM(B$6,B$7,B$8,B$9)","v":{"$error":"#DIV/0!"}},{"$f":"IF(ISBLANK('JMF SUBMITTAL FORM'!D54),\" \",'JMF SUBMITTAL FORM'!D54)","v":" "},null,{"$f":"IF(ISBLANK('JMF SUBMITTAL FORM'!D54),\" \",VLOOKUP('JMF SUBMITTAL FORM'!D54,CM_NAME_CODES,3,0))","v":" "},"ABS VOLUME",null,{"$f":"D16","v":1.6199999999999999}]
["Cm 2",{"$f":"'JMF SUBMITTAL FORM'!AG56","v":0},{"$f":"'JMF SUBMITTAL FORM'!AA56","v":0},0,{"$f":"B7/SUM(B$6,B$7,B$8,B$9)","v":{"$error":"#DIV/0!"}},{"$f":"IF(ISBLANK('JMF SUBMITTAL FORM'!D56),\" \",'JMF SUBMITTAL FORM'!D56)","v":" "},null,{"$f":"IF(ISBLANK('JMF SUBMITTAL FORM'!D56),\" \",VLOOKUP('JMF SUBMITTAL FORM'!D56,CM_NAME_CODES,3,0))","v":" "}]
["Cm 3",{"$f":"'JMF SUBMITTAL FORM'!AG58","v":0},{"$f":"'JMF SUBMITTAL FORM'!AA58","v":0},0,{"$f":"B8/SUM(B$6,B$7,B$8,B$9)","v":{"$error":"#DIV/0!"}},{"$f":"IF(ISBLANK('JMF SUBMITTAL FORM'!D58),\" \",'JMF SUBMITTAL FORM'!D58)","v":" "},null,{"$f":"IF(ISBLANK('JMF SUBMITTAL FORM'!D58),\" \",VLOOKUP('JMF SUBMITTAL FORM'!D58,CM_NAME_CODES,3,0))","v":" "},"WEIGHT/YD3",null,{"$f":"SUM(K4,K2,B10)","v":0}]
["Cm 4",{"$f":"'JMF SUBMITTAL FORM'!AG60","v":0},{"$f":"'JMF SUBMITTAL FORM'!AA60","v":0},0,{"$f":"B9/SUM(B$6,B$7,B$8,B$9)","v":{"$error":"#DIV/0!"}},{"$f":"IF(ISBLANK('JMF SUBMITTAL FORM'!D60),\" \",'JMF SUBMITTAL FORM'!D60)","v":" "},null,{"$f":"IF(ISBLANK('JMF SUBMITTAL FORM'!D60),\" \",VLOOKUP('JMF SUBMITTAL FORM'!D60,CM_NAME_CODES,3,0))","v":" "}]
["H2O",{"$f":"'JMF SUBMITTAL FORM'!AG64","v":0},1,{"$f":"B10/(62.4*C10)","v":0},"AGG VOL.",null,null,null,"THEO UNIT WT",null,{"$f":"K8/K6","v":0}]
["AIR",{"$f":"'JMF SUBMITTAL FORM'!G64","v":0.06},null,{"$f":"27*B11","v":1.6199999999999999},{"$f":"SUM(D2:D5)","v":0},"LISTED","CERTIFIED AS"]
["ADMIX 1",{"$f":"IF(ISBLANK('JMF SUBMITTAL FORM'!AG69),\" \",'JMF SUBMITTAL FORM'!AG69*('JMF SUBMITTAL FORM'!AG62/100))","v":" "},{"$f":"IF(ISBLANK('JMF SUBMITTAL FORM'!AG69),\" \",'JMF SUBMITTAL FORM'!AG69)","v":" "},null,"PASTE VOL.",{"$f":"IF(ISBLANK('JMF SUBMITTAL FORM'!AB69),\" \",'JMF SUBMITTAL FORM'!AB69)","v":" "},{"$f":"IF(ISBLANK('JMF SUBMITTAL FORM'!N69),\" \",VLOOKUP('JMF SUBMITTAL FORM'!N69,ADMIX_VLOOK,3,0))","v":" "},null,"MAX W/Cm RATIO",null,{"$f":"'JMF SUBMITTAL FORM'!W63","v":{"$error":"#DIV/0!"}}]
["ADMIX 2",{"$f":"IF(ISBLANK('JMF SUBMITTAL FORM'!AG71),\" \",'JMF SUBMITTAL FORM'!AG71*('JMF SUBMITTAL FORM'!AG$62/100))","v":" "},{"$f":"IF(ISBLANK('JMF SUBMITTAL FORM'!AG71),\" \",'JMF SUBMITTAL FORM'!AG71)","v":" "},"TOTAL VOL",{"$f":"SUM(D6:D11)+D15","v":1.6199999999999999},{"$f":"IF(ISBLANK('JMF SUBMITTAL FORM'!AB71),\" \",'JMF SUBMITTAL FORM'!AB71)","v":" "},{"$f":"IF(ISBLANK('JMF SUBMITTAL FORM'!N71),\" \",VLOOKUP('JMF SUBMITTAL FORM'!N71,ADMIX_VLOOK,3,0))","v":" "}]
["ADMIX 3",{"$f":"IF(ISBLANK('JMF SUBMITTAL FORM'!AG73),\" \",'JMF SUBMITTAL FORM'!AG73*('JMF SUBMITTAL FORM'!AG$62/100))","v":" "},{"$f":"IF(ISBLANK('JMF SUBMITTAL FORM'!AG73),\" \",'JMF SUBMITTAL FORM'!AG73)","v":" "},{"$f":"SUM(D2:D11)","v":1.6199999999999999},null,{"$f":"IF(ISBLANK('JMF SUBMITTAL FORM'!AB73),\" \",'JMF SUBMITTAL FORM'!AB73)","v":" "},{"$f":"IF(ISBLANK('JMF SUBMITTAL FORM'!N73),\" \",VLOOKUP('JMF SUBMITTAL FORM'!N73,ADMIX_VLOOK,3,0))","v":" "}]
["ADMIX 4",{"$f":"IF(ISBLANK('JMF SUBMITTAL FORM'!AG75),\" \",'JMF SUBMITTAL FORM'!AG75*('JMF SUBMITTAL FORM'!AG$62/100))","v":" "},{"$f":"IF(ISBLANK('JMF SUBMITTAL FORM'!AG75),\" \",'JMF SUBMITTAL FORM'!AG75)","v":" "},{"$f":"SUM(B13,B14,B15,B16)/(128*7.49)","v":0},null,{"$f":"IF(ISBLANK('JMF SUBMITTAL FORM'!AB75),\" \",'JMF SUBMITTAL FORM'!AB75)","v":" "},{"$f":"IF(ISBLANK('JMF SUBMITTAL FORM'!N75),\" \",VLOOKUP('JMF SUBMITTAL FORM'!N75,ADMIX_VLOOK,3,0))","v":" "}]
{"$rows_left_out":26}
{"sheet":"STATUS LETTER","index":2,"n_rows":39,"n_cols":11,"rows_kept":39,"cut":false,"hidden":false,"merged":[[28,1,28,2],[4,0,4,2],[5,1,5,4],[5,5,5,6],[9,5,9,6],[8,5,8,6],[7,5,7,6],[6,5,6,6],[9,1,9,4],[12,1,12,4],[7,1,7,4],[6,1,6,4],[8,1,8,4],[10,0,10,2],[11,1,11,4],[19,5,19,6],[18,1,18,4],[18,5,18,6],[19,1,19,4],[23,1,23,4],[22,1,22,4],[21,1,21,4],[20,1,20,4],[23,5,23,6],[22,5,22,6],[21,5,21,6],[20,5,20,6],[0,7,0,8],[0,5,0,6],[17,0,17,2],[16,5,16,6],[1,0,1,2],[2,0,2,2],[1,3,1,6],[2,3,2,4],[11,5,11,6],[15,5,15,6],[14,5,14,6],[13,5,13,6],[12,5,12,6],[15,1,15,4],[14,1,14,4],[13,1,13,4],[25,1,25,2],[25,4,25,5],[26,4,26,5],[27,4,27,5],[27,6,27,10],[0,1,0,2],[38,0,47,10],[19,7,23,10],[30,1,30,10],[31,1,36,10],[24,0,24,10],[3,0,3,10],[1,8,2,10],[1,7,2,7],[26,1,26,2],[16,2,16,3],[7,10,9,10],[13,10,15,10],[25,7,25,8],[26,7,26,8],[27,1,27,2]]}
["Date:",{"$f":"'JMF INPUT SHEET'!J36","v":"00:00:00"},null,null,null,"SUBMITTAL STATUS:",null,{"$f":"IF('JMF INPUT SHEET'!L35=1,\"APPROVED\",IF('JMF INPUT SHEET'!L35=2,\"PENDING\",\"NOT APPROVED\"))","v":"APPROVED"}]
["PRODUCER/SUPPLIER:",null,null,{"$f":"'JMF SUBMITTAL FORM'!H3","v":0},null,null,null,"JMF #",{"$f":"'JMF INPUT SHEET'!B19","v":0}]
["CLASS OF CONCRETE:",null,null,{"$f":"'JMF SUBMITTAL FORM'!H21","v":0}]
["MIX DESIGN"]
["AGGREGATES:",null,null,null,null,null,null,null,null,"SSD"]
[null,"Source",null,null,null,"Size / Type",null,"Sp. Gr.","Abs.","Design Wt"]
[null,{"$f":"IF(ISBLANK('JMF SUBMITTAL FORM'!D40),\" \",'JMF SUBMITTAL FORM'!D40)","v":" "},null,null,null,{"$f":"IF(ISBLANK('JMF SUBMITTAL FORM'!S40),\" \",'JMF SUBMITTAL FORM'!S40)","v":" "},null,{"$f":"IF(ISBLANK('JMF SUBMITTAL FORM'!AA40),\" \",'JMF SUBMITTAL FORM'!AA40)","v":" "},{"$f":"IF(ISBLANK('JMF SUBMITTAL FORM'!AD40),\" \",'JMF SUBMITTAL FORM'!AD40)","v":" "},{"$f":"IF(ISBLANK('JMF SUBMITTAL FORM'!AG40),\" \",'JMF SUBMITTAL FORM'!AG40)","v":" "},"TOTAL"]
[null,{"$f":"IF(ISBLANK('JMF SUBMITTAL FORM'!D42),\" \",'JMF SUBMITTAL FORM'!D42)","v":" "},null,null,null,{"$f":"IF(ISBLANK('JMF SUBMITTAL FORM'!S42),\" \",'JMF SUBMITTAL FORM'!S42)","v":" "},null,{"$f":"IF(ISBLANK('JMF SUBMITTAL FORM'!AA42),\" \",'JMF SUBMITTAL FORM'!AA42)","v":" "},{"$f":"IF(ISBLANK('JMF SUBMITTAL FORM'!AD42),\" \",'JMF SUBMITTAL FORM'!AD42)","v":" "},{"$f":"IF(ISBLANK('JMF SUBMITTAL FORM'!AG42),\" \",'JMF SUBMITTAL FORM'!AG42)","v":" "},{"$f":"'JMF INPUT SHEET'!K2","v":0}]
[null,{"$f":"'JMF SUBMITTAL FORM'!D44","v":0},null,null,null,{"$f":"IF(ISBLANK('JMF SUBMITTAL FORM'!S44),\" \",'JMF SUBMITTAL FORM'!S44)","v":" "},null,{"$f":"IF(ISBLANK('JMF SUBMITTAL FORM'!AA44),\" \",'JMF SUBMITTAL FORM'!AA44)","v":" "},{"$f":"IF(ISBLANK('JMF SUBMITTAL FORM'!AD44),\" \",'JMF SUBMITTAL FORM'!AD44)","v":" "},{"$f":"IF(ISBLANK('JMF SUBMITTAL FORM'!AG44),\" \",'JMF SUBMITTAL FORM'!AG44)","v":" "}]
[null,{"$f":"IF(ISBLANK('JMF SUBMITTAL FORM'!D46),\" \",'JMF SUBMITTAL FORM'!D46)","v":" "},null,null,null,{"$f":"IF(ISBLANK('JMF SUBMITTAL FORM'!S46),\" \",'JMF SUBMITTAL FORM'!S46)","v":" "},null,{"$f":"IF(ISBLANK('JMF SUBMITTAL FORM'!AA46),\" \",'JMF SUBMITTAL FORM'!AA46)","v":" "},{"$f":"IF(ISBLANK('JMF SUBMITTAL FORM'!AD46),\" \",'JMF SUBMITTAL FORM'!AD46)","v":" "},{"$f":"IF(ISBLANK('JMF SUBMITTAL FORM'!AG46),\" \",'JMF SUBMITTAL FORM'!AG46)","v":" "}]
["CEMENTITIOUS MATERIALS:"]
[null,"Source",null,null,null,"Material",null,"Sp. Gr."]
[null,{"$f":"IF(ISBLANK('JMF SUBMITTAL FORM'!N54),\" \",'JMF SUBMITTAL FORM'!N54)","v":" "},null,null,null,{"$f":"IF(ISBLANK('JMF SUBMITTAL FORM'!D54),\" \",'JMF SUBMITTAL FORM'!D54)","v":" "},null,{"$f":"IF(ISBLANK('JMF SUBMITTAL FORM'!AA54),\" \",'JMF SUBMITTAL FORM'!AA54)","v":" "},null,{"$f":"IF(ISBLANK('JMF SUBMITTAL FORM'!AG54),\" \",'JMF SUBMITTAL FORM'!AG54)","v":" "},"TOTAL"]
[null,{"$f":"IF(ISBLANK('JMF SUBMITTAL FORM'!N56),\" \",'JMF SUBMITTAL FORM'!N56)","v":" "},null,null,null,{"$f":"IF(ISBLANK('JMF SUBMITTAL FORM'!D56),\" \",'JMF SUBMITTAL FORM'!D56)","v":" "},null,{"$f":"IF(ISBLANK('JMF SUBMITTAL FORM'!AA56),\" \",'JMF SUBMITTAL FORM'!AA56)","v":" "},null,{"$f":"IF(ISBLANK('JMF SUBMITTAL FORM'!AG56),\" \",'JMF SUBMITTAL FORM'!AG56)","v":" "},{"$f":"'JMF INPUT SHEET'!K4","v":0}]
[null,{"$f":"IF(ISBLANK('JMF SUBMITTAL FORM'!N58),\" \",'JMF SUBMITTAL FORM'!N58)","v":" "},null,null,null,{"$f":"IF(ISBLANK('JMF SUBMITTAL FORM'!D58),\" \",'JMF SUBMITTAL FORM'!D58)","v":" "},null,{"$f":"IF(ISBLANK('JMF SUBMITTAL FORM'!AA58),\" \",'JMF SUBMITTAL FORM'!AA58)","v":" "},null,{"$f":"IF(ISBLANK('JMF SUBMITTAL FORM'!AG58),\" \",'JMF SUBMITTAL FORM'!AG58)","v":" "}]
{"$rows_left_out":25}
{"sheet":"LOOKUP TABLES","index":3,"n_rows":32,"n_cols":12,"rows_kept":32,"cut":false,"hidden":true,"merged":[[1,9,1,11],[7,9,7,11],[14,1,14,3],[4,6,4,7],[3,6,3,7],[2,6,2,7],[1,1,1,8],[14,5,14,7],[12,6,12,7],[11,6,11,7],[7,6,7,7],[10,6,10,7],[9,6,9,7],[8,6,8,7],[6,6,6,7],[5,6,5,7],[29,1,29,2],[14,9,14,10],[34,1,34,2],[33,1,33,2],[32,1,32,2],[31,1,31,2],[30,1,30,2]]}
[]
[null,"CLASS_LIST",null,null,null,null,null,null,null,"ACI FORMULAS"]
[null,"CLASS","MTL CD","DSGN PSI","AGE","PERM","GRADATION RQMT",null,"ACI PSI","F1 < 5000",{"$f":"'JMF SUBMITTAL FORM'!AC125+(1.34*'JMF SUBMITTAL FORM'!AC133*'JMF SUBMITTAL FORM'!AC129)","v":{"$error":"#N/A"}},"GREATER"]
[null,"QC 1","215QC1",4000,"28 DAYS",2000,"WELL-GRADED",null,5200,"F2 < 5000",{"$f":"'JMF SUBMITTAL FORM'!AC125+(2.33*'JMF SUBMITTAL FORM'!AC133*'JMF SUBMITTAL FORM'!AC129)-500","v":{"$error":"#N/A"}},{"$f":"MAX(K3,K4)","v":{"$error":"#N/A"}}]
[null,"QC 2","215QC2",4500,"28 DAYS",1500,"WELL-GRADED",null,5700]
[null,"QC 3","215QC3","SPECIFY","SPECIFY","PER PLAN","WELL-GRADED",null,"CALC","F1 > 5000",{"$f":"'JMF SUBMITTAL FORM'!AC125+(1.34*'JMF SUBMITTAL FORM'!AC133*'JMF SUBMITTAL FORM'!AC129)","v":{"$error":"#N/A"}},"GREATER"]
[null,"QC 4","215QC4","SPECIFY","SPECIFY","PER PLAN","WELL-GRADED",null,"CALC","F2 > 5000",{"$f":"('JMF SUBMITTAL FORM'!AC125*0.9)+(2.33*'JMF SUBMITTAL FORM'!AC133*'JMF SUBMITTAL FORM'!AC129)","v":{"$error":"#N/A"}},{"$f":"MAX(K6,K7)","v":{"$error":"#N/A"}}]
[null,"QC 5","215QC5",4500,"28 DAYS","N/A","1\" OR 1/2\" NOM. MAX SIZE",null,5700,"WITH NO DATA"]
[null,"QC MISC","215QCMI",4000,"28 DAYS","N/A","1\" NOM. MAX SIZE",null,"85 PWL","F< 5000",{"$f":"'JMF SUBMITTAL FORM'!AC125+1200","v":1200}]
[null,"QC MS","215QCMS","400 MOR","24 HRS","N/A","1\" NOM. MAX SIZE",null,"N/A","F> 5000",{"$f":"(1.1*'JMF SUBMITTAL FORM'!AC125)+700","v":700}]
[null,"QC FS","215QCFS","400 MOR","4 HRS","N/A","1\" NOM. MAX SIZE",null,"N/A"]
[]
[]
[]
[null,"CM_NAMES_CODES",null,null,"TEXT","ADMIX_TYPE_CODES ",null,null,null,"K_VALUES"]
{"$rows_left_out":18}
{"sheet":"AGG MATL CD LIST","index":4,"n_rows":55,"n_cols":3,"rows_kept":55,"cut":false,"hidden":true,"merged":[]}
["SPECIAL AGG 02","02D011","02D011"]
["Shale 703.02",20008,"020008"]
["SAND, NATURAL AI/02","021SD23","021SD23"]
["SAND, NATURAL /02","021SD2","021SD2"]
["SAND STONE /02","025SD2","025SD2"]
["CR GRAVEL SAND /02","024SD2","024SD2"]
["9 GRAVEL 9/02",23009,"023009"]
["89 CRUSHED STONE",25089,"025089"]
["8 GRAVEL 8SS/02(.25)",230081,"0230081"]
["8 GRAVEL 8SS/02",230080,"0230080"]
["8 GRAVEL 8/02",23008,"023008"]
["8 GRAVEL 451-452 02",230082,"0230082"]
["8 CR STONE 8SS/02",250080,"0250080"]
["8 CR STONE 8/02",25008,"025008"]
["8 CR ST 8SS/02 (.25)",250081,"0250081"]
{"$rows_left_out":41}
{"sheet":"RM_NAME_CODE","index":5,"n_rows":104,"n_cols":2,"rows_kept":104,"cut":false,"hidden":true,"merged":[[1,3,1,5]]}
["A K READY MIX","3329Q-01"]
["ABC CONCRETE","3201Q-01"]
["ADAMS BROS","2915Q-01"]
["ALL OHIO RM","2629Q-01"]
["ALLEGA","3602Q-01"]
["ANDERSON","3001Q-01"]
["ASHTABULA","2850Q-01"]
["ASSOCIATED","2732Q-01"]
["BAKER-SHINDLER READY MIX","2508Q-01"]
["BESSEMER","2855Q-01"]
["BRYCE HILL","3105Q-01"]
["BUCKEYE RM","2901Q-01"]
["CALDWELL RM","2912Q-01"]
["CAMDEN RM","3227Q-01"]
["CARR BROS","3603Q-01"]
{"$rows_left_out":90}
{"sheet":"AGG PROD LIST","index":6,"n_rows":261,"n_cols":2,"rows_kept":261,"cut":false,"hidden":true,"merged":[]}
["ALBERT EXCAVATING-COSHOCTON  (04432-01)","04432-01"]
["ALLEGHENY-HARRISVILLE,PA  (04385-01)","04385-01"]
["ALLEGHENY-SLIPPERY ROCK,PA  (04376-01)","04376-01"]
["ALLIED CORP-MASSILLON  (04339-01)","04339-01"]
["ALLIED CORP-PETERSBURG  (04372-01)","04372-01"]
["AMERICAN S&G#4-MASSILLON  (04303-01)","04303-01"]
["ARCH-BATAVIA  (04791-01)","04791-01"]
["AREA AGG-WOODVILLE  (04163-01)","04163-01"]
["BALLENTINE-MANTUA  (04378-01)","04378-01"]
["BARRETT (LS)-SIDNEY  (4623B-01)","4623B-01"]
["BARRETT(GR)-HARDIN  (04624-01)","04624-01"]
["BARRETT(LS)-SIDNEY  (4623A-01)","4623A-01"]
["BARRETT-FAIRBORN  (04608-01)","04608-01"]
["BARRETT-MEDWAY  (04743-01)","04743-01"]
["BARRETT-RICHMOND,IN  (04747-01)","04747-01"]
{"$rows_left_out":247}
{"sheet":"AGG MATL LIST","index":7,"n_rows":917,"n_cols":4,"rows_kept":917,"cut":false,"hidden":true,"merged":[]}
["ALBERT EXCAVATING-COSHOCTON  (04432-01)","04432-01",23057,"57 GRAVEL 57/02"]
["ALBERT EXCAVATING-COSHOCTON  (04432-01)","04432-01",23008,"8 GRAVEL 8/02"]
["ALBERT EXCAVATING-COSHOCTON  (04432-01)","04432-01","021SD2","SAND, NATURAL /02"]
["ALLEGHENY-HARRISVILLE,PA  (04385-01)","04385-01",25057,"57 CR STONE 57/02"]
["ALLEGHENY-HARRISVILLE,PA  (04385-01)","04385-01",250570,"57 CR STONE 57SS/02"]
["ALLEGHENY-HARRISVILLE,PA  (04385-01)","04385-01",250081,"8 CR ST 8SS/02 (.25)"]
["ALLEGHENY-HARRISVILLE,PA  (04385-01)","04385-01",25008,"8 CR STONE 8/02"]
["ALLEGHENY-HARRISVILLE,PA  (04385-01)","04385-01",250080,"8 CR STONE 8SS/02"]
["ALLEGHENY-SLIPPERY ROCK,PA  (04376-01)","04376-01",25057,"57 CR STONE 57/02"]
["ALLEGHENY-SLIPPERY ROCK,PA  (04376-01)","04376-01",25067,"67 CR STONE 67/02"]
["ALLEGHENY-SLIPPERY ROCK,PA  (04376-01)","04376-01",25008,"8 CR STONE 8/02"]
["ALLIED CORP-MASSILLON  (04339-01)","04339-01",23057,"57 GRAVEL 57/02"]
["ALLIED CORP-MASSILLON  (04339-01)","04339-01",23008,"8 GRAVEL 8/02"]
["ALLIED CORP-MASSILLON  (04339-01)","04339-01","021SD2","SAND, NATURAL /02"]
["ALLIED CORP-MASSILLON  (04339-01)","04339-01","021SD23","SAND, NATURAL AI/02"]
{"$rows_left_out":903}
{"sheet":"Cm MATL LIST","index":8,"n_rows":130,"n_cols":4,"rows_kept":130,"cut":false,"hidden":true,"merged":[]}
["375IL","CERTIFIED CEMENT SUPPLIER","04302-02","BLENDED CEMENT 1L"]
["375IL","HOLCIM/GENEVIEVE,MO (BLOOMSVILLE)","06868-01","BLENDED CEMENT 1L"]
[37504,"ARMSTRONG/CABOT","06645-01","CEM TYPE 1"]
[37504,"BUZZI UNICEM/CAPE GR","06585-01","CEM TYPE 1"]
[37504,"BUZZI UNICEM/FESTUS","06885-01","CEM TYPE 1"]
[37504,"BUZZI UNICEM/GRNCAST","06586-01","CEM TYPE 1"]
[37504,"CEMEX-KOSMOS/LOUISVL","06590-01","CEM TYPE 1"]
[37504,"CEMEX/FAIRBORN","06564-01","CEM TYPE 1"]
[37504,"CERTIFIED CEMENT SUPPLIER","04302-02","CEM TYPE 1"]
[37504,"CTS CEM-RAPID SET/CA","06789-01","CEM TYPE 1"]
[37504,"ESSROC/LOGANSPORT IN","06566-01","CEM TYPE 1"]
[37504,"ESSROC/MARTNSBURG WV","06772-01","CEM TYPE 1"]
[37504,"ESSROC/NAZARETH PA","06567-01","CEM TYPE 1"]
[37504,"ESSROC/PICTON ONT","06580-01","CEM TYPE 1"]
[37504,"ESSROC/SPEED IN","06569-01","CEM TYPE 1"]
{"$rows_left_out":116}
{"sheet":"ADMIX PS LIST","index":9,"n_rows":12,"n_cols":2,"rows_kept":12,"cut":false,"hidden":true,"merged":[]}
["BASF CONST CHEMICALS","06528-01"]
["CHRYSO INC/IN","06821-01"]
["CORTEC LAB / MN","06810-01"]
["EUCLID CHEMICAL CO","06511-01"]
["GENERAL RESOURCE/MN","06712-01"]
["GRACE CONST PROD/MA","06517-01"]
["HYCRETE TECH/NJ","06806-01"]
["HYDRATION KONTROL/KY","06521-01"]
["OCCIDENTAL CHEMICAL","06870-01"]
["PREMIERE CONCRETE","06844-01"]
["RUSSTECH ADMIX/KY","06546-01"]
["SIKA-MARION","06547-01"]

{"sheet":"ADMIX PRODUCT LIST","index":10,"n_rows":274,"n_cols":4,"rows_kept":274,"cut":false,"hidden":true,"merged":[]}
["06502-01","CATEXOL 1000SP-MN-C",42106,"TYPE F"]
["06502-01","CATEXOL AE-260",42001," AEA"]
["06502-01","CATEXOL AE-360",42001," AEA"]
["06502-01","CATEXOL CN-CI",43301,"CORR INHIB"]
["06502-01","CATEXOL HYDROSENSE",42110,"TYPE A,F"]
["06502-01","DURAFLUX 44",42110,"TYPE A,F"]
["06502-01","SUPERFLUX 2000 PC",42106,"TYPE F"]
["06502-01","VR CONCENTRATE",42001," AEA"]
["06511-01","*ACCELGUARD HE",42113,"TYPE C,E"]
["06511-01","ACCELGUARD 80",42113,"TYPE C,E"]
["06511-01","ACCELGUARD 90",42113,"TYPE C,E"]
["06511-01","ACCELGUARD NCA",42113,"TYPE C,E"]
["06511-01","AIREXTRA",42001," AEA"]
["06511-01","EUCO AIR MIX",42001," AEA"]
["06511-01","EUCON 1037",42106,"TYPE F"]
{"$rows_left_out":259}